BDBM50283318 2-Butyl-3-(3-fluoro-2'-(butyloxycarbonylaminosulphonyl)-biphenyl-4-ylmethyl)-6-(isopropyl-methyl-aminocarbonylamino)-3H-quinazolin-4-one::CHEMBL415073
SMILES CCCCOC(=O)NS(=O)(=O)c1ccccc1-c1ccc(Cn2c(CCCC)nc3ccc(NC(=O)N(C)C(C)C)cc3c2=O)c(F)c1
InChI Key InChIKey=YZRHNUCZSNUXFT-UHFFFAOYSA-N
Data  6 IC50
  Tab Delimited (TSV)   2D SDfile   Computed 3D by Vconf -m prep SDfile
Find this compound or compounds like it in BindingDB:
Activity Spreadsheet -- Enzyme Inhibition Constant Data from BindingDB
Found 6 hits for monomerid = 50283318
TargetType-2 angiotensin II receptor(RAT)
TBA
Curated by ChEMBL
LigandPNGBDBM50283318(2-Butyl-3-(3-fluoro-2'-(butyloxycarbonylaminosulph...)
Affinity DataIC50:  0.770nM. Assay description: In vivo inhibitory concentration of the compound against AT2 receptor of rat adrenal membrane
In DepthDetails Article
TargetType-1 angiotensin II receptor(Homo sapiens (Human))
TBA
Curated by ChEMBL
LigandPNGBDBM50283318(2-Butyl-3-(3-fluoro-2'-(butyloxycarbonylaminosulph...)
Affinity DataIC50:  0.890nM. Assay description: In vivo inhibitory concentration of the compound against Angiotensin II receptor, type 1 of human adrenal membrane
In DepthDetails Article
TargetType-2 angiotensin II receptor(RAT)
TBA
Curated by ChEMBL
LigandPNGBDBM50283318(2-Butyl-3-(3-fluoro-2'-(butyloxycarbonylaminosulph...)
Affinity DataIC50:  0.440nM. Assay description: In vivo inhibitory concentration against Angiotensin II, type 2 of rat midbrain membrane
In DepthDetails Article
TargetType-2 angiotensin II receptor(Homo sapiens (Human))
TBA
Curated by ChEMBL
LigandPNGBDBM50283318(2-Butyl-3-(3-fluoro-2'-(butyloxycarbonylaminosulph...)
Affinity DataIC50:  7.70nM. Assay description: In vivo inhibitory concentration of the compound against AT2 receptor of human adrenal membrane
In DepthDetails Article
LigandPNGBDBM50283318(2-Butyl-3-(3-fluoro-2'-(butyloxycarbonylaminosulph...)
Affinity DataIC50:  0.25nM. Assay description: In vivo inhibitory concentration against Angiotensin II receptor, type 1 of rat adrenal membrane
In DepthDetails Article
TargetType-1 angiotensin II receptor(RABBIT)
TBA
Curated by ChEMBL
LigandPNGBDBM50283318(2-Butyl-3-(3-fluoro-2'-(butyloxycarbonylaminosulph...)
Affinity DataIC50:  0.190nM. Assay description: In vivo inhibitory concentration of the compound against Angiotensin II receptor, type 1 of rabbit aorta membrane
In DepthDetails Article