BDBM50283358 CHEMBL79799::[(S)-1-(1-Benzyl-3-benzylcarbamoyl-3,3-difluoro-2-oxo-propylcarbamoyl)-2-methyl-propyl]-carbamic acid benzyl ester
SMILES CC(C)[C@H](NC(=O)OCc1ccccc1)C(=O)NC(Cc1ccccc1)C(=O)C(F)(F)C(=O)NCc1ccccc1
InChI Key InChIKey=XZMDRIWIUCSMJY-AMVUTOCUSA-N
Data  1 KI
  Tab Delimited (TSV)   2D SDfile   Computed 3D by Vconf -m prep SDfile
Find this compound or compounds like it in BindingDB:
Activity Spreadsheet -- Enzyme Inhibition Constant Data from BindingDB
Found 1 hit for monomerid = 50283358
TargetGag-Pol polyprotein [489-587](Human immunodeficiency virus type 1)
TBA
Curated by ChEMBL
LigandPNGBDBM50283358(CHEMBL79799 | [(S)-1-(1-Benzyl-3-benzylcarbamoyl-3...)
Affinity DataKi:  1nM. Assay description: Compound was tested for inactivation of purified HIV-1 protease in vitro
In DepthDetails Article