BDBM50283401 (1-Benzyl-piperidin-4-yl)-phenyl-((E)-3-phenyl-allyl)-amine; compound with (E)-but-2-enedioic acid::CHEMBL115506
SMILES C(\C=C\c1ccccc1)N(C1CCN(Cc2ccccc2)CC1)c1ccccc1
InChI Key InChIKey=WXDFSBOGRSXWPP-XNTDXEJSSA-N
Data  2 KI  1 IC50
  Tab Delimited (TSV)   2D SDfile   Computed 3D by Vconf -m prep SDfile
Find this compound or compounds like it in BindingDB:
Activity Spreadsheet -- Enzyme Inhibition Constant Data from BindingDB
Found 3 hits for monomerid = 50283401
TargetSigma non-opioid intracellular receptor 1(Homo sapiens (Human))
TBA
Curated by ChEMBL
LigandPNGBDBM50283401((1-Benzyl-piperidin-4-yl)-phenyl-((E)-3-phenyl-all...)
Affinity DataKi:  1.50E+3nM. Assay description: Inhibiton of [3H]-(+)-SKF-10,047 binding to sigma receptor
In DepthDetails Article
Target5-hydroxytryptamine receptor 2A/2B/2C(Homo sapiens (Human))
TBA
Curated by ChEMBL
LigandPNGBDBM50283401((1-Benzyl-piperidin-4-yl)-phenyl-((E)-3-phenyl-all...)
Affinity DataKi: >1.00E+4nM. Assay description: Displacement of [3H]ketanserin from 5-hydroxytryptamine 2 receptor
In DepthDetails Article
TargetD(2) dopamine receptor(Homo sapiens (Human))
TBA
Curated by ChEMBL
LigandPNGBDBM50283401((1-Benzyl-piperidin-4-yl)-phenyl-((E)-3-phenyl-all...)
Affinity DataIC50: >1.00E+4nM. Assay description: Displacement of [3H]-spiperone from dopamine D2 receptor
In DepthDetails Article