BDBM50283475 CHEMBL78679::Tetradecanoic acid (2R,4S)-2-hydroxymethyl-6-oxo-tetrahydro-pyran-4-yl ester
SMILES CCCCCCCCCCCCCC(=O)O[C@H]1C[C@H](CO)OC(=O)C1
InChI Key InChIKey=BNGAHEQYKMAXEK-ZWKOTPCHSA-N
Data  1 KI
  Tab Delimited (TSV)   2D SDfile   Computed 3D by Vconf -m prep SDfile
Find this compound or compounds like it in BindingDB:
Activity Spreadsheet -- Enzyme Inhibition Constant Data from BindingDB
Found 1 hit for monomerid = 50283475
TargetProtein kinase C alpha type(Bos taurus (bovine))
TBA
Curated by ChEMBL
LigandPNGBDBM50283475(CHEMBL78679 | Tetradecanoic acid (2R,4S)-2-hydroxy...)
Affinity DataKi:  2.05E+4nM. Assay description: Displacement of [3H-20]-phorbol-12-13-dibutyrate from bovine brain protein kinase C alpha
In DepthDetails Article