BDBM50283753 (S)-2-[(2S,5R)-5-((R)-2-Amino-3-mercapto-propionylamino)-2-cyclohexylmethyl-6-methyl-heptanoylamino]-4-methylsulfanyl-butyric acid::CHEMBL262246
SMILES CSCC[C@H](NC(=O)[C@@H](CC[C@@H](NC(=O)[C@@H](N)CS)C(C)C)CC1CCCCC1)C(O)=O
InChI Key InChIKey=MYXMGXMJSAQYSZ-HAGHYFMRSA-N
Data  2 IC50
  Tab Delimited (TSV)   2D SDfile   Computed 3D by Vconf -m prep SDfile
Find this compound or compounds like it in BindingDB:
Activity Spreadsheet -- Enzyme Inhibition Constant Data from BindingDB
Found 2 hits for monomerid = 50283753
LigandPNGBDBM50283753((S)-2-[(2S,5R)-5-((R)-2-Amino-3-mercapto-propionyl...)
Affinity DataIC50:  1.84E+4nM. Assay description: Inhibitory activity against geranylgeranyl transferase
In DepthDetails Article
LigandPNGBDBM50283753((S)-2-[(2S,5R)-5-((R)-2-Amino-3-mercapto-propionyl...)
Affinity DataIC50:  1.90E+3nM. Assay description: Inhibition of farnesyl transferase
In DepthDetails Article