BDBM50283792 1-[5-(1-Aza-bicyclo[2.2.2]oct-2-en-3-yl)-thiophen-2-yl]-ethanone::CHEMBL94921
SMILES CC(=O)c1ccc(s1)C1=CN2CCC1CC2
InChI Key InChIKey=UEPTUEJDVFQHBN-UHFFFAOYSA-N
Data  4 KI
  Tab Delimited (TSV)   2D SDfile   Computed 3D by Vconf -m prep SDfile
Find this compound or compounds like it in BindingDB:
Activity Spreadsheet -- Enzyme Inhibition Constant Data from BindingDB
Found 4 hits for monomerid = 50283792
TargetMuscarinic acetylcholine receptor M1(Homo sapiens (Human))
TBA
Curated by ChEMBL
LigandPNGBDBM50283792(1-[5-(1-Aza-bicyclo[2.2.2]oct-2-en-3-yl)-thiophen-...)
Affinity DataKi:  480nM. Assay description: In vitro binding affinity of the compound towards muscarinic receptor in cerebral cortex (M1) was determined
In DepthDetails Article
TargetMuscarinic acetylcholine receptor M2(Homo sapiens (Human))
TBA
Curated by ChEMBL
LigandPNGBDBM50283792(1-[5-(1-Aza-bicyclo[2.2.2]oct-2-en-3-yl)-thiophen-...)
Affinity DataKi:  1.55E+3nM. Assay description: In vitro binding affinity of the compound towards muscarinic receptor in heart (M2) was determined
In DepthDetails Article
TargetMuscarinic acetylcholine receptor M1/M2/M3/M4/M5(Homo sapiens (Human))
TBA
Curated by ChEMBL
LigandPNGBDBM50283792(1-[5-(1-Aza-bicyclo[2.2.2]oct-2-en-3-yl)-thiophen-...)
Affinity DataKi:  2.60E+3nM. Assay description: In vitro binding affinity towards muscarinic receptor in urinary bladder was determined
In DepthDetails Article
TargetMuscarinic acetylcholine receptor M3(Homo sapiens (Human))
TBA
Curated by ChEMBL
LigandPNGBDBM50283792(1-[5-(1-Aza-bicyclo[2.2.2]oct-2-en-3-yl)-thiophen-...)
Affinity DataKi:  2.60E+3nM. Assay description: In vitro binding affinity towards muscarinic receptor in parotid gland (M3)
In DepthDetails Article