BDBM50283806 CHEMBL4166188
SMILES C\C(=N/NC(=O)C1=C(O)c2ccccc2S(=O)(=O)N1Cc1ccccc1)c1ccccc1
InChI Key InChIKey=CASZZFSIRPMISF-KOEQRZSOSA-N
Data  2 IC50
  Tab Delimited (TSV)   2D SDfile   Computed 3D by Vconf -m prep SDfile
Find this compound or compounds like it in BindingDB:
Activity Spreadsheet -- Enzyme Inhibition Constant Data from BindingDB
Found 2 hits for monomerid = 50283806
TargetAmine oxidase [flavin-containing] A(Rattus norvegicus (rat))
Government College University
Curated by ChEMBL
LigandPNGBDBM50283806(CHEMBL4166188)
Affinity DataIC50:  1.22E+3nM. Assay description: Inhibition of MAO-A in rat liver mitochondria using p-tyramine as substrate preincubated for 10 mins followed by substrate addition measured after 30...
In DepthDetails ArticlePubMed
TargetAmine oxidase [flavin-containing] B(Rattus norvegicus (rat))
Government College University
Curated by ChEMBL
LigandPNGBDBM50283806(CHEMBL4166188)
Affinity DataIC50:  2.26E+3nM. Assay description: Inhibition of MAO-B in rat liver mitochondria using p-tyramine as substrate preincubated for 10 mins followed by substrate addition measured after 30...
In DepthDetails ArticlePubMed