BDBM50283832 CHEMBL319504::N-tert-Butyl-2-[(3R,5S,7R)-2-oxo-7-phenyl-5-p-tolyl-3-(3-m-tolyl-ureido)-azepan-1-yl]-acetamide
SMILES Cc1ccc(cc1)[C@H]1C[C@@H](NC(=O)Nc2cccc(C)c2)C(=O)N(CC(=O)NC(C)(C)C)[C@H](C1)c1ccccc1
InChI Key InChIKey=RSXHCVGPXZSMBO-WIIGKZCBSA-N
Data  2 IC50
  Tab Delimited (TSV)   2D SDfile   Computed 3D by Vconf -m prep SDfile
Find this compound or compounds like it in BindingDB:
Activity Spreadsheet -- Enzyme Inhibition Constant Data from BindingDB
Found 2 hits for monomerid = 50283832
TargetGastrin/cholecystokinin type B receptor(Homo sapiens (Human))
TBA
Curated by ChEMBL
LigandPNGBDBM50283832(CHEMBL319504 | N-tert-Butyl-2-[(3R,5S,7R)-2-oxo-7-...)
Affinity DataIC50:  190nM. Assay description: Inhibitory activity against cholecystokinin-B (CCK-B) receptor in cortex of male hartley guinea pig.
In DepthDetails Article
TargetCholecystokinin receptor type A(Cavia porcellus)
TBA
Curated by ChEMBL
LigandPNGBDBM50283832(CHEMBL319504 | N-tert-Butyl-2-[(3R,5S,7R)-2-oxo-7-...)
Affinity DataIC50:  1.10nM. Assay description: Inhibitory activity against cholecystokinin-A (CCK-A) receptor in pancreas of guinea pig.
In DepthDetails Article