BDBM50284008 CHEMBL265164::Trp-Ile-Ile-Asp-Leu-Hisc(Cys-Ser-Apa-Val-Tyr-Phe-Cys)
SMILES CC[C@H](C)[C@H](NC(=O)[C@H](CC(O)=O)NC(=O)[C@H](CC(C)C)NC(=O)[C@H](Cc1cnc[nH]1)NC(=O)[C@H]1CSSC[C@H](N)C(=O)N[C@@H](CO)C(=O)NCCCCC(=O)N[C@H](C(C)C)C(=O)N[C@@H](Cc2ccc(O)cc2)C(=O)N[C@H](Cc2ccccc2)C(=O)N1)C(=O)N[C@@H]([C@@H](C)CC)C(=O)N[C@@H](Cc1c[nH]c2ccccc12)C(O)=O
InChI Key InChIKey=DOBUMMJIGJNUMP-ANRTWLEFSA-N
Data  3 IC50
  Tab Delimited (TSV)   2D SDfile   Computed 3D by Vconf -m prep SDfile
Find this compound or compounds like it in BindingDB:
Activity Spreadsheet -- Enzyme Inhibition Constant Data from BindingDB
Found 3 hits for monomerid = 50284008
TargetEndothelin-1 receptor(Homo sapiens (Human))
TBA
Curated by ChEMBL
LigandPNGBDBM50284008(CHEMBL265164 | Trp-Ile-Ile-Asp-Leu-Hisc(Cys-Ser-Ap...)
Affinity DataIC50:  2.50E+3nM. Assay description: Binding affinity against Endothelin A receptor in rabbit renal artery vascular smooth muscle membrane (ET-A)
In DepthDetails Article
TargetEndothelin receptor type B(RAT)
TBA
Curated by ChEMBL
LigandPNGBDBM50284008(CHEMBL265164 | Trp-Ile-Ile-Asp-Leu-Hisc(Cys-Ser-Ap...)
Affinity DataIC50:  350nM. Assay description: Binding affinity against endothelin receptor in rat cerebellar membrane (ET-B) from adult blue laurie rat
In DepthDetails Article
TargetEndothelin-1 receptor(RAT)
TBA
Curated by ChEMBL
LigandPNGBDBM50284008(CHEMBL265164 | Trp-Ile-Ile-Asp-Leu-Hisc(Cys-Ser-Ap...)
Affinity DataIC50:  1.80E+3nM. Assay description: In vitro binding affinity against Endothelin A receptor by using endothelin (ET-1) as radioligand in rat heart ventricle
In DepthDetails Article