BDBM50284090 CHEMBL350972::Pyrazolo[1,5-a]pyridine-3-carboxylic acid 8-methyl-8-aza-bicyclo[3.2.1]oct-3-yl ester
SMILES CN1C2CCC1CC(C2)OC(=O)c1cnn2ccccc12
InChI Key InChIKey=OYMSVEYECKLFKC-UHFFFAOYSA-N
Data  3 IC50
  Tab Delimited (TSV)   2D SDfile   Computed 3D by Vconf -m prep SDfile
Find this compound or compounds like it in BindingDB:
Activity Spreadsheet -- Enzyme Inhibition Constant Data from BindingDB
Found 3 hits for monomerid = 50284090
Target5-hydroxytryptamine receptor 1A(Homo sapiens (Human))
TBA
Curated by ChEMBL
LigandPNGBDBM50284090(CHEMBL350972 | Pyrazolo[1,5-a]pyridine-3-carboxyli...)
Affinity DataIC50: >1.00E+4nM. Assay description: Tested for binding affinity for 5-hydroxytryptamine 1A receptor
In DepthDetails Article
Target5-hydroxytryptamine receptor 3A/3B(Rattus norvegicus)
TBA
Curated by ChEMBL
LigandPNGBDBM50284090(CHEMBL350972 | Pyrazolo[1,5-a]pyridine-3-carboxyli...)
Affinity DataIC50:  28nM. Assay description: Inhibition of [3H]GR-65630 binding to rat cortical membrane serotonin 3 receptor
In DepthDetails Article
TargetD(2) dopamine receptor(Homo sapiens (Human))
TBA
Curated by ChEMBL
LigandPNGBDBM50284090(CHEMBL350972 | Pyrazolo[1,5-a]pyridine-3-carboxyli...)
Affinity DataIC50: >1.00E+4nM. Assay description: Tested for binding affinity for Dopamine D2 receptors
In DepthDetails Article