BDBM50284416 2-{[Acetyl-(3-octadecylcarbamoyloxymethyl-cyclobutylmethoxycarbonyl)-amino]-methyl}-1-ethyl-pyridinium; iodide::CHEMBL12438
SMILES CCCCCCCCCCCCCCCCCCNC(=O)OC[C@H]1C[C@H](COC(=O)N(Cc2cccc[n+]2CC)C(C)=O)C1
InChI Key InChIKey=WURIOLSVFPRDJG-KGPRPGCCSA-O
Data  1 KI  1 IC50
  Tab Delimited (TSV)   2D SDfile   Computed 3D by Vconf -m prep SDfile
Find this compound or compounds like it in BindingDB:
Activity Spreadsheet -- Enzyme Inhibition Constant Data from BindingDB
Found 2 hits for monomerid = 50284416
TargetPlatelet-activating factor receptor(Cavia porcellus)
TBA
Curated by ChEMBL
LigandPNGBDBM50284416(2-{[Acetyl-(3-octadecylcarbamoyloxymethyl-cyclobut...)
Affinity DataKi:  4.30nM. Assay description: In vitro ability to displace [3H]-PAF from PAF receptor in rabbit platelet membranes
In DepthDetails Article
TargetPlatelet-activating factor receptor(Cavia porcellus)
TBA
Curated by ChEMBL
LigandPNGBDBM50284416(2-{[Acetyl-(3-octadecylcarbamoyloxymethyl-cyclobut...)
Affinity DataIC50:  56nM. Assay description: In vitro inhibitory activity against PAF-induced aggregation of rabbit platelets
In DepthDetails Article