BDBM50284495 4-[5-(4-Fluoro-phenyl)-2-(4-methanesulfinyl-phenyl)-3H-imidazol-4-yl]-quinoline::CHEMBL16911
SMILES CS(=O)c1ccc(cc1)-c1nc(c([nH]1)-c1ccc(F)cc1)-c1ccnc2ccccc12
InChI Key InChIKey=RXGCJIGYVLKTIO-UHFFFAOYSA-N
Data  2 IC50
  Tab Delimited (TSV)   2D SDfile   Computed 3D by Vconf -m prep SDfile
Find this compound or compounds like it in BindingDB:
Activity Spreadsheet -- Enzyme Inhibition Constant Data from BindingDB
Found 2 hits for monomerid = 50284495
TargetPolyunsaturated fatty acid 5-lipoxygenase(Homo sapiens (Human))
TBA
Curated by ChEMBL
LigandPNGBDBM50284495(4-[5-(4-Fluoro-phenyl)-2-(4-methanesulfinyl-phenyl...)
Affinity DataIC50:  710nM. Assay description: Inhibitory activity against interleukin-1(IL-1) synthesis, using intact human monocytes
In DepthDetails Article
TargetPolyunsaturated fatty acid 5-lipoxygenase(Rattus norvegicus)
TBA
Curated by ChEMBL
LigandPNGBDBM50284495(4-[5-(4-Fluoro-phenyl)-2-(4-methanesulfinyl-phenyl...)
Affinity DataIC50:  7.20E+3nM. Assay description: Inhibitory activity against 5-lipoxygenase enzyme from RBL-1 cells
In DepthDetails Article