BDBM50284510 4-(4-ethyl-2-(4-methoxyphenyl)-1H-imidazol-5-yl)pyridine::4-(5-ethyl-2-(4-methoxyphenyl)-1H-imidazol-4-yl)pyridine::4-[5-Ethyl-2-(4-methoxy-phenyl)-3H-imidazol-4-yl]-pyridine::CHEMBL278724::SB-202474
SMILES CCc1[nH]c(nc1-c1ccncc1)-c1ccc(OC)cc1
InChI Key InChIKey=MYKGURNPAUBQLJ-UHFFFAOYSA-N
Data  2 IC50
  Tab Delimited (TSV)   2D SDfile   Computed 3D by Vconf -m prep SDfile
Find this compound or compounds like it in BindingDB:
Activity Spreadsheet -- Enzyme Inhibition Constant Data from BindingDB
Found 2 hits for monomerid = 50284510
TargetPolyunsaturated fatty acid 5-lipoxygenase(Homo sapiens (Human))
TBA
Curated by ChEMBL
LigandPNGBDBM50284510(4-(4-ethyl-2-(4-methoxyphenyl)-1H-imidazol-5-yl)py...)
Affinity DataIC50: >5.00E+3nM. Assay description: Inhibitory activity against interleukin-1(IL-1) synthesis, using intact human monocytes
In DepthDetails Article
TargetTGF-beta receptor type-1(Homo sapiens (Human))
Sichuan University
Curated by ChEMBL
LigandPNGBDBM50284510(4-(4-ethyl-2-(4-methoxyphenyl)-1H-imidazol-5-yl)py...)
Affinity DataIC50:  3.00E+4nM. Assay description: Inhibition of TGFR1
In DepthDetails ArticlePubMed