BDBM50284654 CHEMBL29725::N-{3-[2'-(1-Methyl-1H-tetrazol-5-yl)-biphenyl-4-ylmethyl]-4-oxo-3,4-dihydro-quinazolin-6-yl}-N-pyridin-2-ylmethyl-isonicotinamide
SMILES Cn1nnnc1-c1ccccc1-c1ccc(Cn2cnc3ccc(cc3c2=O)N(Cc2ccccn2)C(=O)c2ccncc2)cc1
InChI Key InChIKey=FLSISKDSSXJVNN-UHFFFAOYSA-N
Data  3 IC50
  Tab Delimited (TSV)   2D SDfile   Computed 3D by Vconf -m prep SDfile
Find this compound or compounds like it in BindingDB:
Activity Spreadsheet -- Enzyme Inhibition Constant Data from BindingDB
Found 3 hits for monomerid = 50284654
TargetType-1 angiotensin II receptor(RABBIT)
TBA
Curated by ChEMBL
LigandPNGBDBM50284654(CHEMBL29725 | N-{3-[2'-(1-Methyl-1H-tetrazol-5-yl)...)
Affinity DataIC50:  9.70nM. Assay description: Binding affinity against AT1 receptor in rabbit aorta
In DepthDetails Article
LigandPNGBDBM50284654(CHEMBL29725 | N-{3-[2'-(1-Methyl-1H-tetrazol-5-yl)...)
Affinity DataIC50:  2.90nM. Assay description: Binding affinity against AT1 receptor in rat adrenal tissue
In DepthDetails Article
TargetType-1 angiotensin II receptor(Homo sapiens (Human))
TBA
Curated by ChEMBL
LigandPNGBDBM50284654(CHEMBL29725 | N-{3-[2'-(1-Methyl-1H-tetrazol-5-yl)...)
Affinity DataIC50:  4.40nM. Assay description: Binding affinity against AT1 receptor in human adrenal tissue
In DepthDetails Article