BDBM50284660 CHEMBL29654::N-{3-[2'-(1-Methyl-1H-tetrazol-5-yl)-biphenyl-4-ylmethyl]-4-oxo-3,4-dihydro-quinazolin-6-yl}-N-pentyl-isonicotinamide
SMILES CCCCCN(C(=O)c1ccncc1)c1ccc2ncn(Cc3ccc(cc3)-c3ccccc3-c3nnnn3C)c(=O)c2c1
InChI Key InChIKey=OWLZFWSXDZPTID-UHFFFAOYSA-N
Data  1 IC50
  Tab Delimited (TSV)   2D SDfile   Computed 3D by Vconf -m prep SDfile
Find this compound or compounds like it in BindingDB:
Activity Spreadsheet -- Enzyme Inhibition Constant Data from BindingDB
Found 1 hit for monomerid = 50284660
TargetType-1 angiotensin II receptor(RABBIT)
TBA
Curated by ChEMBL
LigandPNGBDBM50284660(CHEMBL29654 | N-{3-[2'-(1-Methyl-1H-tetrazol-5-yl)...)
Affinity DataIC50:  2.80nM. Assay description: Binding affinity against AT1 receptor in rabbit aorta
In DepthDetails Article