BDBM50285151 (S)-3-{(S)-2-[(R)-2-Acetylamino-2-(10,11-dihydro-5H-dibenzo[a,d]cyclohepten-5-yl)-acetylamino]-4-methyl-pentanoylamino}-N-((S)-1-{(1S,2S)-1-[(S)-1-carboxy-2-(1H-indol-3-yl)-ethylcarbamoyl]-2-methyl-butylcarbamoyl}-ethyl)-succinamic acid::CHEMBL65559
SMILES CC[C@H](C)[C@H](NC(=O)[C@H](C)NC(=O)[C@H](CC(O)=O)NC(=O)[C@H](CC(C)C)NC(=O)[C@H](NC(C)=O)C1c2ccccc2CCc2ccccc12)C(=O)N[C@@H](Cc1c[nH]c2ccccc12)C(O)=O
InChI Key InChIKey=WVFHCUSQLBYXPW-QUAQWQRWSA-N
Data  1 IC50
  Tab Delimited (TSV)   2D SDfile   Computed 3D by Vconf -m prep SDfile
Find this compound or compounds like it in BindingDB:
Activity Spreadsheet -- Enzyme Inhibition Constant Data from BindingDB
Found 1 hit for monomerid = 50285151
TargetEndothelin-1 receptor(Sus scrofa)
TBA
Curated by ChEMBL
LigandPNGBDBM50285151((S)-3-{(S)-2-[(R)-2-Acetylamino-2-(10,11-dihydro-5...)
Affinity DataIC50:  30nM. Assay description: Inhibition of endothelin (ET-A) binding to porcine heart membranes
In DepthDetails Article