BDBM50285299 1-[7,7-dimethyl-1-spiro[2,3-dihydro-1H-indene-1,4'-(hexahydropyridine)]-1-ylsulfonylmethyl-(1S,2S)-bicyclo[2.2.1]hept-2-yl]-3-hydroxy-(3S)-tetrahydro-1H-2,5-pyrroledione::CHEMBL283994
SMILES CC1(C)C2CC[C@@]1(CS(=O)(=O)N1CCC3(CCc4ccccc34)CC1)[C@H](C2)N1C(=O)C[C@H](O)C1=O
InChI Key InChIKey=WQSZIJNHVPYRCY-ZLBHQKHFSA-N
Data  3 IC50
  Tab Delimited (TSV)   2D SDfile   Computed 3D by Vconf -m prep SDfile
Find this compound or compounds like it in BindingDB:
Activity Spreadsheet -- Enzyme Inhibition Constant Data from BindingDB
Found 3 hits for monomerid = 50285299
TargetOxytocin receptor(RAT)
TBA
Curated by ChEMBL
LigandPNGBDBM50285299(1-[7,7-dimethyl-1-spiro[2,3-dihydro-1H-indene-1,4'...)
Affinity DataIC50:  20nM. Assay description: Inhibition of binding of [3H]-oxytocin to rat uterine oxytocin receptor
In DepthDetails Article
TargetVasopressin V2 receptor(Rattus norvegicus (Rat))
TBA
Curated by ChEMBL
LigandPNGBDBM50285299(1-[7,7-dimethyl-1-spiro[2,3-dihydro-1H-indene-1,4'...)
Affinity DataIC50:  1.50E+3nM. Assay description: Inhibition of binding of [3H]-vasopressin to rat kidney vasopressin V2 receptor
In DepthDetails Article
TargetVasopressin V1a receptor(RAT)
TBA
Curated by ChEMBL
LigandPNGBDBM50285299(1-[7,7-dimethyl-1-spiro[2,3-dihydro-1H-indene-1,4'...)
Affinity DataIC50:  945nM. Assay description: Inhibition of binding of [3H]-vasopressin to rat liver vasopressin V1a receptor
In DepthDetails Article