BDBM50285357 2-{Carboxy-[4-(7-methyl-2-propyl-imidazo[4,5-b]pyridin-3-ylmethyl)-phenoxy]-methyl}-benzoic acid::CHEMBL290465
SMILES CCCc1nc2c(C)ccnc2n1Cc1ccc(OC(C(O)=O)c2ccccc2C(O)=O)cc1
InChI Key InChIKey=ASNCDNSJHCPGED-UHFFFAOYSA-N
Data  1 IC50
  Tab Delimited (TSV)   2D SDfile   Computed 3D by Vconf -m prep SDfile
Find this compound or compounds like it in BindingDB:
Activity Spreadsheet -- Enzyme Inhibition Constant Data from BindingDB
Found 1 hit for monomerid = 50285357
TargetType-1 angiotensin II receptor(RABBIT)
TBA
Curated by ChEMBL
LigandPNGBDBM50285357(2-{Carboxy-[4-(7-methyl-2-propyl-imidazo[4,5-b]pyr...)
Affinity DataIC50:  235nM. Assay description: Tested in vitro for Angiotensin II receptor, type 1 binding affinity using rabbit aorta binding assay
In DepthDetails Article