BDBM50285418 Benzooxazol-2-yl-ethyl-{5-[5-(4-methylsulfanyl-phenyl)-4-phenyl-1H-imidazol-2-ylsulfanyl]-pentyl}-amine::CHEMBL51000
SMILES CCN(CCCCCSc1nc(c([nH]1)-c1ccc(SC)cc1)-c1ccccc1)c1nc2ccccc2o1
InChI Key InChIKey=LQJNNFNWQSLYOK-UHFFFAOYSA-N
Data  2 IC50
  Tab Delimited (TSV)   2D SDfile   Computed 3D by Vconf -m prep SDfile
Find this compound or compounds like it in BindingDB:
Activity Spreadsheet -- Enzyme Inhibition Constant Data from BindingDB
Found 2 hits for monomerid = 50285418
TargetSterol O-acyltransferase 1(Mus musculus)
TBA
Curated by ChEMBL
LigandPNGBDBM50285418(Benzooxazol-2-yl-ethyl-{5-[5-(4-methylsulfanyl-phe...)
Affinity DataIC50:  500nM. Assay description: Inhibition of Acyl coenzyme A:cholesterol acyltransferase in J774 Macrophage cell culture
In DepthDetails Article
TargetSterol O-acyltransferase 1(Rattus norvegicus)
TBA
Curated by ChEMBL
LigandPNGBDBM50285418(Benzooxazol-2-yl-ethyl-{5-[5-(4-methylsulfanyl-phe...)
Affinity DataIC50:  700nM. Assay description: In vitro inhibition of Acyl coenzyme A:cholesterol acyltransferase in rat hepatic microsomes was measured by using AIV assay
In DepthDetails Article