BDBM50285427 Benzooxazol-2-yl-{5-[4,5-bis-(4-methoxy-phenyl)-1H-imidazol-2-ylsulfanyl]-pentyl}-ethyl-amine::CHEMBL54032
SMILES CCN(CCCCCSc1nc(c([nH]1)-c1ccc(OC)cc1)-c1ccc(OC)cc1)c1nc2ccccc2o1
InChI Key InChIKey=ODOBCFFQEAXLPC-UHFFFAOYSA-N
Data  2 IC50
  Tab Delimited (TSV)   2D SDfile   Computed 3D by Vconf -m prep SDfile
Find this compound or compounds like it in BindingDB:
Activity Spreadsheet -- Enzyme Inhibition Constant Data from BindingDB
Found 2 hits for monomerid = 50285427
TargetSterol O-acyltransferase 1(Mus musculus)
TBA
Curated by ChEMBL
LigandPNGBDBM50285427(Benzooxazol-2-yl-{5-[4,5-bis-(4-methoxy-phenyl)-1H...)
Affinity DataIC50:  90nM. Assay description: Inhibition of Acyl coenzyme A:cholesterol acyltransferase in J774 Macrophage cell culture
In DepthDetails Article
TargetSterol O-acyltransferase 1(Rattus norvegicus)
TBA
Curated by ChEMBL
LigandPNGBDBM50285427(Benzooxazol-2-yl-{5-[4,5-bis-(4-methoxy-phenyl)-1H...)
Affinity DataIC50:  140nM. Assay description: In vitro inhibition of Acyl coenzyme A:cholesterol acyltransferase in rat hepatic microsomes was measured by using AIV assay
In DepthDetails Article