BDBM50285517 4-[3-(4-Fluoro-phenyl)-benzofuran-2-yl]-benzenesulfonamide::CHEMBL77714
SMILES NS(=O)(=O)c1ccc(cc1)-c1oc2ccccc2c1-c1ccc(F)cc1
InChI Key InChIKey=WVSOERYRTLIVHL-UHFFFAOYSA-N
Data  2 IC50
  Tab Delimited (TSV)   2D SDfile   Computed 3D by Vconf -m prep SDfile
Find this compound or compounds like it in BindingDB:
Activity Spreadsheet -- Enzyme Inhibition Constant Data from BindingDB
Found 2 hits for monomerid = 50285517
TargetProstaglandin G/H synthase 2(Homo sapiens (Human))
TBA
Curated by ChEMBL
LigandPNGBDBM50285517(4-[3-(4-Fluoro-phenyl)-benzofuran-2-yl]-benzenesul...)
Affinity DataIC50:  7nM. Assay description: In vitro inhibitory activity against human recombinant cyclooxygenase-2 enzyme
In DepthDetails Article
TargetProstaglandin G/H synthase 1(Homo sapiens (Human))
TBA
Curated by ChEMBL
LigandPNGBDBM50285517(4-[3-(4-Fluoro-phenyl)-benzofuran-2-yl]-benzenesul...)
Affinity DataIC50:  490nM. Assay description: In vitro inhibitory activity against human recombinant cyclooxygenase-1 enzyme
In DepthDetails Article