BDBM50285725 CHEMBL4161602
SMILES [H][C@@]1(CC[C@@]2([H])[C@]3([H])[C@H](O)[C@H](CC)[C@]4([H])C[C@H](O)CC[C@]4(C)[C@@]3([H])CC[C@]12C)[C@H](C)CCNC(=O)OCc1cccs1
InChI Key InChIKey=XNRUIJRZNKMSKR-OKCMQTCBSA-N
Data  2 EC50
  Tab Delimited (TSV)   2D SDfile   Computed 3D by Vconf -m prep SDfile
Find this compound or compounds like it in BindingDB:
Activity Spreadsheet -- Enzyme Inhibition Constant Data from BindingDB
Found 2 hits for monomerid = 50285725
TargetBile acid receptor(Homo sapiens (Human))
Wuxi Apptec (Shanghai)
Curated by ChEMBL
LigandPNGBDBM50285725(CHEMBL4161602)
Affinity DataEC50:  230nM. Assay description: Agonist activity at recombinant human GST-tagged FXR LBD (193 to 472 residues) expressed in baculovirus-infected insect cells assessed as recruitment...
In DepthDetails ArticlePubMed
TargetBile acid receptor(Homo sapiens (Human))
Wuxi Apptec (Shanghai)
Curated by ChEMBL
LigandPNGBDBM50285725(CHEMBL4161602)
Affinity DataEC50:  110nM. Assay description: Agonist activity at FXR (unknown origin) measured after 16 hrs in presence of CCF4-AM dye by cell-based GeneBlazer FRET assay
In DepthDetails ArticlePubMed