BDBM50285762 5-alpha-hydroxyacid imidazolyl biphenyl sulfonyl urea analogue::CHEMBL432378
SMILES CCCCC(O)(C(O)=O)c1c(SC)nc(CCC)n1Cc1ccc(cc1)-c1ccccc1S(=O)(=O)NC(=O)NCc1ccccc1
InChI Key InChIKey=QOCGTVLAVHEWKU-UHFFFAOYSA-N
Data  2 IC50
  Tab Delimited (TSV)   2D SDfile   Computed 3D by Vconf -m prep SDfile
Find this compound or compounds like it in BindingDB:
Activity Spreadsheet -- Enzyme Inhibition Constant Data from BindingDB
Found 2 hits for monomerid = 50285762
LigandPNGBDBM50285762(5-alpha-hydroxyacid imidazolyl biphenyl sulfonyl u...)
Affinity DataIC50:  0.5nM. Assay description: In vitro binding affinity at Angiotensin II Type 1 receptor in rat liver membrane by [125I]AII displacement.
In DepthDetails Article
TargetType-2 angiotensin II receptor(Homo sapiens (Human))
TBA
Curated by ChEMBL
LigandPNGBDBM50285762(5-alpha-hydroxyacid imidazolyl biphenyl sulfonyl u...)
Affinity DataIC50:  0.900nM. Assay description: In vitro binding affinity at Angiotensin II Type 2 receptor in rabbit uterus membrane by [125I]-AII displacement.
In DepthDetails Article