BDBM50285852 Acetic acid (3S,4S,6S,6aS,12R,12bS)-3-acetoxy-4-acetoxymethyl-12-hydroxy-4,6a,12b-trimethyl-9-(1-methyl-pyridinium-3-yl)-11-oxo-1,3,4,4a,5,6,6a,12,12a,12b-decahydro-2H,11H-7,10-dioxa-benzo[a]anthracen-6-yl ester::CHEMBL441168
SMILES CC(=O)OCC1(C)[C@H](CC[C@@]2(C)C1C[C@H](OC(C)=O)[C@@]1(C)Oc3cc(oc(=O)c3[C@H](O)C21)-c1ccc[n+](C)c1)OC(C)=O
InChI Key InChIKey=DMGHSMMQEUIYAK-SQICNRLFSA-N
Data  1 IC50
  Tab Delimited (TSV)   2D SDfile   Computed 3D by Vconf -m prep SDfile
Find this compound or compounds like it in BindingDB:
Activity Spreadsheet -- Enzyme Inhibition Constant Data from BindingDB
Found 1 hit for monomerid = 50285852
TargetSterol O-acyltransferase 1(Rattus norvegicus)
TBA
Curated by ChEMBL
LigandPNGBDBM50285852(Acetic acid (3S,4S,6S,6aS,12R,12bS)-3-acetoxy-4-ac...)
Affinity DataIC50:  2.10E+3nM. Assay description: Inhibitory activity against acyl-CoA:cholesterol O-acyltransferase (ACAT)
In DepthDetails Article