BDBM50285854 CHEMBL328676::Pyripyropene derivative
SMILES CCCC(N)C(=O)O[C@H]1CC2[C@]3(C)COC4(CCCCC4)O[C@H]3CC[C@]2(C)C2[C@@H](O)c3c(O[C@]12C)cc(oc3=O)-c1cccnc1
InChI Key InChIKey=ROPBDLZCVLFSRF-SXGRAWJWSA-N
Data  1 IC50
  Tab Delimited (TSV)   2D SDfile   Computed 3D by Vconf -m prep SDfile
Find this compound or compounds like it in BindingDB:
Activity Spreadsheet -- Enzyme Inhibition Constant Data from BindingDB
Found 1 hit for monomerid = 50285854
TargetSterol O-acyltransferase 1(Rattus norvegicus)
TBA
Curated by ChEMBL
LigandPNGBDBM50285854(CHEMBL328676 | Pyripyropene derivative)
Affinity DataIC50:  39nM. Assay description: Inhibitory activity against acyl-CoA:cholesterol O-acyltransferase (ACAT)
In DepthDetails Article