BDBM50285856 12-hydroxy-4,6a,12b-trimethyl-3-methylcarbonyloxy-11-oxo-4-propoxymethyl-9-(3-pyridyl)-(3S,4R,6S,6aS,12R,12bS)-1,3,4,4a,5,6,6a,12,12a,12b-decahydro-2H,11H-benzo[f]pyrano[4,3-b]chromen-6-yl acetate::CHEMBL91466
SMILES CCCOCC1(C)[C@H](CC[C@@]2(C)C1C[C@H](OC(C)=O)[C@@]1(C)Oc3cc(oc(=O)c3[C@H](O)C21)-c1cccnc1)OC(C)=O
InChI Key InChIKey=KXAHBGRHBULPNL-SQICNRLFSA-N
Data  1 IC50
  Tab Delimited (TSV)   2D SDfile   Computed 3D by Vconf -m prep SDfile
Find this compound or compounds like it in BindingDB:
Activity Spreadsheet -- Enzyme Inhibition Constant Data from BindingDB
Found 1 hit for monomerid = 50285856
TargetSterol O-acyltransferase 1(Rattus norvegicus)
TBA
Curated by ChEMBL
LigandPNGBDBM50285856(12-hydroxy-4,6a,12b-trimethyl-3-methylcarbonyloxy-...)
Affinity DataIC50:  270nM. Assay description: Inhibitory activity against acyl-CoA:cholesterol O-acyltransferase (ACAT)
In DepthDetails Article