BDBM50285984 6-(4-Fluoro-phenylsulfanyl)-3-(3-pyridin-3-yl-1H-pyrrolo[1,2-c]thiazole-7-carbonyl)-indole-1-carboxylic acid dimethylamide::CHEMBL98844
SMILES CN(C)C(=O)n1cc(C(=O)c2ccn3C(SCc23)c2cccnc2)c2ccc(Sc3ccc(F)cc3)cc12
InChI Key InChIKey=OVNCCUMKSZBYKL-UHFFFAOYSA-N
Data  1 KI
  Tab Delimited (TSV)   2D SDfile   Computed 3D by Vconf -m prep SDfile
Find this compound or compounds like it in BindingDB:
Activity Spreadsheet -- Enzyme Inhibition Constant Data from BindingDB
Found 1 hit for monomerid = 50285984
TargetPlatelet-activating factor receptor(Cavia porcellus)
TBA
Curated by ChEMBL
LigandPNGBDBM50285984(6-(4-Fluoro-phenylsulfanyl)-3-(3-pyridin-3-yl-1H-p...)
Affinity DataKi:  17nM. Assay description: Tested in vitro for antagonistic activity to displace [3H]-PAF from rabbit platelet membrane PAF receptors
In DepthDetails Article