BDBM50286155 1-[(S)-1-(4-Benzoyl-piperidine-1-carbonyl)-3-methyl-butyl]-3-m-tolyl-urea::CHEMBL105153
SMILES CC(C)C[C@H](NC(=O)Nc1cccc(C)c1)C(=O)N1CCC(CC1)C(=O)c1ccccc1
InChI Key InChIKey=MKSXYEGXLQLQEF-QHCPKHFHSA-N
Data  2 IC50
  Tab Delimited (TSV)   2D SDfile   Computed 3D by Vconf -m prep SDfile
Find this compound or compounds like it in BindingDB:
Activity Spreadsheet -- Enzyme Inhibition Constant Data from BindingDB
Found 2 hits for monomerid = 50286155
TargetGastrin/cholecystokinin type B receptor(Homo sapiens (Human))
TBA
Curated by ChEMBL
LigandPNGBDBM50286155(1-[(S)-1-(4-Benzoyl-piperidine-1-carbonyl)-3-methy...)
Affinity DataIC50: >1.00E+4nM. Assay description: Inhibitory activity towards binding of [125I]-Bolton-Hunter-CCK-8 to CCKB receptor in guinea pig cortical tissue
In DepthDetails Article
TargetCholecystokinin receptor type A(Cavia porcellus)
TBA
Curated by ChEMBL
LigandPNGBDBM50286155(1-[(S)-1-(4-Benzoyl-piperidine-1-carbonyl)-3-methy...)
Affinity DataIC50:  5.20E+3nM. Assay description: Inhibitory activity towards binding of [125I]-Bolton-Hunter-CCK-8 to CCKA receptor in guinea pig pancreatic tissue
In DepthDetails Article