BDBM50286246 CHEMBL4159695
SMILES OC(=O)CNC(=O)c1c(O)ccc2ccnn12
InChI Key InChIKey=BFPCNWFESDRJTC-UHFFFAOYSA-N
Data  1 IC50  1 EC50
  Tab Delimited (TSV)   2D SDfile   Computed 3D by Vconf -m prep SDfile
Find this compound or compounds like it in BindingDB:
Activity Spreadsheet -- Enzyme Inhibition Constant Data from BindingDB
Found 2 hits for monomerid = 50286246
TargetEgl nine homolog 1(Homo sapiens (Human))
Japan Tobacco
Curated by ChEMBL
LigandPNGBDBM50286246(CHEMBL4159695)
Affinity DataEC50: >3.00E+4nM. Assay description: Inhibition of PHD2 in human Hep3B cells assessed as increase in EPO release after 24 hrs by ELISA
In DepthDetails ArticlePubMed
TargetEgl nine homolog 1(Homo sapiens (Human))
Japan Tobacco
Curated by ChEMBL
LigandPNGBDBM50286246(CHEMBL4159695)
Affinity DataIC50:  6.50E+3nM. Assay description: Inhibition of human HIF-PHD2 assessed as reduction in HIF1-alpha binding to VBC complex using biotin-labeled HIF1-alpha peptide as substrate preincub...
In DepthDetails ArticlePubMed