BDBM50286915 4-(Carboxymethyl-carbamoyl)-2-phenoxymethyl-5-phenyl-pentanoic acid::CHEMBL349890
SMILES OC(=O)CNC(=O)C(CC(COc1ccccc1)C(O)=O)Cc1ccccc1
InChI Key InChIKey=CPYPLUDLRCSHAZ-UHFFFAOYSA-N
Data  2 IC50
  Tab Delimited (TSV)   2D SDfile   Computed 3D by Vconf -m prep SDfile
Find this compound or compounds like it in BindingDB:
Activity Spreadsheet -- Enzyme Inhibition Constant Data from BindingDB
Found 2 hits for monomerid = 50286915
TargetNeprilysin(Rattus norvegicus (Rat))
TBA
Curated by ChEMBL
LigandPNGBDBM50286915(4-(Carboxymethyl-carbamoyl)-2-phenoxymethyl-5-phen...)
Affinity DataIC50:  407nM. Assay description: In vitro inhibition of neutral endopeptidase from rat kidney.
In DepthDetails Article
TargetNeprilysin(Rattus norvegicus (Rat))
TBA
Curated by ChEMBL
LigandPNGBDBM50286915(4-(Carboxymethyl-carbamoyl)-2-phenoxymethyl-5-phen...)
Affinity DataIC50: >1.00E+3nM. Assay description: In vitro inhibition of neutral endopeptidase from rat kidney.
In DepthDetails Article