BDBM50287028 2-(4-Hydroxy-2-oxo-6-phenyl-2H-pyran-3-ylsulfanylmethyl)-benzoic acid::CHEMBL14675
SMILES OC(=O)c1ccccc1CSc1c(O)cc(oc1=O)-c1ccccc1
InChI Key InChIKey=MXCYPPNQAULBAA-UHFFFAOYSA-N
Data  1 IC50
  Tab Delimited (TSV)   2D SDfile   Computed 3D by Vconf -m prep SDfile
Find this compound or compounds like it in BindingDB:
Activity Spreadsheet -- Enzyme Inhibition Constant Data from BindingDB
Found 1 hit for monomerid = 50287028
TargetGag-Pol polyprotein [489-587](Human immunodeficiency virus type 1)
TBA
Curated by ChEMBL
LigandPNGBDBM50287028(2-(4-Hydroxy-2-oxo-6-phenyl-2H-pyran-3-ylsulfanylm...)
Affinity DataIC50:  2.48E+4nM. Assay description: In vitro inhibitory activity against HIV-1 protease(PR).
In DepthDetails Article