BDBM50287207 (S)-1,3-Dibenzyl-4-(5-hydroxy-pentyl)-tetrahydro-thieno[3,4-d]imidazol-2-one::CHEMBL28619
SMILES OCCCCC[C@@H]1SCC2C1N(Cc1ccccc1)C(=O)N2Cc1ccccc1
InChI Key InChIKey=BYQGXFAPJUCLFA-KOENEWCDSA-N
Data  1 KI
  Tab Delimited (TSV)   2D SDfile   Computed 3D by Vconf -m prep SDfile
Find this compound or compounds like it in BindingDB:
Activity Spreadsheet -- Enzyme Inhibition Constant Data from BindingDB
Found 1 hit for monomerid = 50287207
TargetGag-Pol polyprotein [489-587](Human immunodeficiency virus type 1)
TBA
Curated by ChEMBL
LigandPNGBDBM50287207((S)-1,3-Dibenzyl-4-(5-hydroxy-pentyl)-tetrahydro-t...)
Affinity DataKi:  1.03E+4nM. Assay description: Inhibitory activity against HIV protease enzyme.
In DepthDetails Article