BDBM50287279 (S)-2-{(S)-2-[5-(4-Carbamimidoyl-phenoxy)-pentanoylamino]-3-carboxy-propionylamino}-3-methyl-butyric acid::CHEMBL32473
SMILES CC(C)[C@H](NC(=O)[C@H](CC(O)=O)NC(=O)CCCCOc1ccc(cc1)C(N)=N)C(O)=O
InChI Key InChIKey=LBISNLXVTXJPAJ-YJBOKZPZSA-N
Data  3 IC50
  Tab Delimited (TSV)   2D SDfile   Computed 3D by Vconf -m prep SDfile
Find this compound or compounds like it in BindingDB:
Activity Spreadsheet -- Enzyme Inhibition Constant Data from BindingDB
Found 3 hits for monomerid = 50287279
TargetIntegrin alpha-IIb/beta-3(Homo sapiens (Human))
Fujisawa Pharmaceutical
Curated by ChEMBL
LigandPNGBDBM50287279((S)-2-{(S)-2-[5-(4-Carbamimidoyl-phenoxy)-pentanoy...)
Affinity DataIC50:  229nM. Assay description: Inhibition of alphaIIb-beta3 integrin
In DepthDetails ArticlePubMed
TargetIntegrin alpha-IIb/beta-3(Homo sapiens (Human))
Fujisawa Pharmaceutical
Curated by ChEMBL
LigandPNGBDBM50287279((S)-2-{(S)-2-[5-(4-Carbamimidoyl-phenoxy)-pentanoy...)
Affinity DataIC50:  230nM. Assay description: Inhibition of human platelet adhesion to fibrinogen
In DepthDetails Article
TargetIntegrin alpha-IIb/beta-3(Homo sapiens (Human))
Fujisawa Pharmaceutical
Curated by ChEMBL
LigandPNGBDBM50287279((S)-2-{(S)-2-[5-(4-Carbamimidoyl-phenoxy)-pentanoy...)
Affinity DataIC50:  230nM. Assay description: Inhibition of ADP-induced human platelet aggregation
In DepthDetails Article