BDBM50287375 (R)-N*4*-Hydroxy-N*1*-[(S)-1-(1H-imidazol-2-yl)-3-methyl-butyl]-2-isobutyl-succinamide::CHEMBL298033
SMILES CC(C)C[C@H](CC(=O)NO)C(=O)N[C@@H](CC(C)C)c1ncc[nH]1
InChI Key InChIKey=TUXGRLPRNXNACO-OLZOCXBDSA-N
Data  3 IC50
  Tab Delimited (TSV)   2D SDfile   Computed 3D by Vconf -m prep SDfile
Find this compound or compounds like it in BindingDB:
Activity Spreadsheet -- Enzyme Inhibition Constant Data from BindingDB
Found 3 hits for monomerid = 50287375
TargetStromelysin-1(Homo sapiens (Human))
TBA
Curated by ChEMBL
LigandPNGBDBM50287375((R)-N*4*-Hydroxy-N*1*-[(S)-1-(1H-imidazol-2-yl)-3-...)
Affinity DataIC50:  320nM. Assay description: Inhibition of human fibroblast stromelysin, matrix metalloproteinase-3
In DepthDetails Article
TargetInterstitial collagenase(Homo sapiens (Human))
TBA
Curated by ChEMBL
LigandPNGBDBM50287375((R)-N*4*-Hydroxy-N*1*-[(S)-1-(1H-imidazol-2-yl)-3-...)
Affinity DataIC50:  9nM. Assay description: Inhibition of human fibroblast collagenase, matrix metalloproteinase-1
In DepthDetails Article
TargetMatrilysin(Homo sapiens (Human))
TBA
Curated by ChEMBL
LigandPNGBDBM50287375((R)-N*4*-Hydroxy-N*1*-[(S)-1-(1H-imidazol-2-yl)-3-...)
Affinity DataIC50:  50nM. Assay description: Inhibition of matrilysin, matrix metalloproteinase-7
In DepthDetails Article