BDBM50287517 3-(2,6-Diisopropyl-phenyl)-1-(2-dodecyl-2H-tetrazol-5-yl)-1-phenyl-urea::CHEMBL52443
SMILES CCCCCCCCCCCCn1nnc(n1)N(C(=O)Nc1c(cccc1C(C)C)C(C)C)c1ccccc1
InChI Key InChIKey=BDTOUKJDASDLPQ-UHFFFAOYSA-N
Data  2 IC50
  Tab Delimited (TSV)   2D SDfile   Computed 3D by Vconf -m prep SDfile
Find this compound or compounds like it in BindingDB:
Activity Spreadsheet -- Enzyme Inhibition Constant Data from BindingDB
Found 2 hits for monomerid = 50287517
TargetSterol O-acyltransferase 1(Rattus norvegicus)
TBA
Curated by ChEMBL
LigandPNGBDBM50287517(3-(2,6-Diisopropyl-phenyl)-1-(2-dodecyl-2H-tetrazo...)
Affinity DataIC50:  47nM. Assay description: Liver Acyl coenzyme A:cholesterol acyltransferase inhibitory activity was determined in vitro using [1-14C]-oleolyl-CoA and microsomes isolated from ...
In DepthDetails Article
TargetSterol O-acyltransferase 1(Mus musculus)
TBA
Curated by ChEMBL
LigandPNGBDBM50287517(3-(2,6-Diisopropyl-phenyl)-1-(2-dodecyl-2H-tetrazo...)
Affinity DataIC50:  240nM. Assay description: Compound was tested for its ability to penetrate the cell wall and inhibit macrophage ACAT in cell culture using murine IC-21 macrophages (MAI)
In DepthDetails Article