BDBM50287598 1H-Pyrazole-4-carboxylic acid [(R)-1-((S)-1-carbamoyl-2-pyridin-3-yl-ethylcarbamoyl)-2-mercapto-ethyl]-amide::CHEMBL56821
SMILES NC(=O)[C@H](Cc1cccnc1)NC(=O)[C@H](CS)NC(=O)c1cn[nH]c1
InChI Key InChIKey=LNAFKWVAFRZAIO-RYUDHWBXSA-N
Data  2 IC50
  Tab Delimited (TSV)   2D SDfile   Computed 3D by Vconf -m prep SDfile
Find this compound or compounds like it in BindingDB:
Activity Spreadsheet -- Enzyme Inhibition Constant Data from BindingDB
Found 2 hits for monomerid = 50287598
TargetInterstitial collagenase(Homo sapiens (Human))
TBA
Curated by ChEMBL
LigandPNGBDBM50287598(1H-Pyrazole-4-carboxylic acid [(R)-1-((S)-1-carbam...)
Affinity DataIC50:  26nM. Assay description: Inhibitory activity against human fibroblast collagenase (MMP-1)
In DepthDetails Article
TargetMatrix metalloproteinase-9(Homo sapiens (Human))
TBA
Curated by ChEMBL
LigandPNGBDBM50287598(1H-Pyrazole-4-carboxylic acid [(R)-1-((S)-1-carbam...)
Affinity DataIC50:  71nM. Assay description: Compound was tested for its inhibitory activity against 92 kD gelatinase (MMP-9)
In DepthDetails Article