BDBM50287617 Biphenyl-4-carboxylic acid [(R)-1-((S)-1-carbamoyl-2-phenyl-ethylcarbamoyl)-2-mercapto-ethyl]-amide::CHEMBL53840
SMILES NC(=O)[C@H](Cc1ccccc1)NC(=O)[C@H](CS)NC(=O)c1ccc(cc1)-c1ccccc1
InChI Key InChIKey=ZBXHSBNGFNIURJ-VXKWHMMOSA-N
Data  2 IC50
  Tab Delimited (TSV)   2D SDfile   Computed 3D by Vconf -m prep SDfile
Find this compound or compounds like it in BindingDB:
Activity Spreadsheet -- Enzyme Inhibition Constant Data from BindingDB
Found 2 hits for monomerid = 50287617
TargetInterstitial collagenase(Homo sapiens (Human))
TBA
Curated by ChEMBL
LigandPNGBDBM50287617(Biphenyl-4-carboxylic acid [(R)-1-((S)-1-carbamoyl...)
Affinity DataIC50:  425nM. Assay description: Inhibitory activity against human fibroblast collagenase (MMP-1)
In DepthDetails Article
TargetMatrix metalloproteinase-9(Homo sapiens (Human))
TBA
Curated by ChEMBL
LigandPNGBDBM50287617(Biphenyl-4-carboxylic acid [(R)-1-((S)-1-carbamoyl...)
Affinity DataIC50:  21nM. Assay description: Compound was tested for its inhibitory activity against 92 kD gelatinase (MMP-9)
In DepthDetails Article