BDBM50287861 (S)-3-(4-Benzyloxy-phenyl)-2-((S)-2-mercaptomethyl-3-phenyl-propionylamino)-propionic acid::CHEMBL74386
SMILES OC(=O)[C@H](Cc1ccc(OCc2ccccc2)cc1)NC(=O)[C@@H](CS)Cc1ccccc1
InChI Key InChIKey=VZNWRBOVBLYQPH-VWNXMTODSA-N
Data  1 IC50
  Tab Delimited (TSV)   2D SDfile   Computed 3D by Vconf -m prep SDfile
Find this compound or compounds like it in BindingDB:
Activity Spreadsheet -- Enzyme Inhibition Constant Data from BindingDB
Found 1 hit for monomerid = 50287861
TargetEndothelin-converting enzyme 1(Rattus norvegicus (Rat))
TBA
Curated by ChEMBL
LigandPNGBDBM50287861((S)-3-(4-Benzyloxy-phenyl)-2-((S)-2-mercaptomethyl...)
Affinity DataIC50:  700nM. Assay description: In vitro inhibition of Endothelin-converting enzyme 1 from rat lungs.
In DepthDetails Article