BDBM50287907 4-[2-Acetyl-4-(3-methoxy-benzyloxy)-phenoxy]-butyronitrile::CHEMBL18993
SMILES COc1cccc(COc2ccc(OCCCC#N)c(c2)C(C)=O)c1
InChI Key InChIKey=RWFMHQHNWOQIKX-UHFFFAOYSA-N
Data  1 IC50
  Tab Delimited (TSV)   2D SDfile   Computed 3D by Vconf -m prep SDfile
Find this compound or compounds like it in BindingDB:
Activity Spreadsheet -- Enzyme Inhibition Constant Data from BindingDB
Found 1 hit for monomerid = 50287907
TargetAmine oxidase [flavin-containing] B(Rattus norvegicus (rat))
TBA
Curated by ChEMBL
LigandPNGBDBM50287907(4-[2-Acetyl-4-(3-methoxy-benzyloxy)-phenoxy]-butyr...)
Affinity DataIC50:  200nM. Assay description: In vitro inhibitory activity against monoamine oxidase B (MAO-B).
In DepthDetails Article