BDBM50287969 (S)-3-{[(R)-1-(3-Piperidin-4-yl-propionyl)-piperidine-3-carbonyl]-amino}-3-thiophen-2-yl-propionic acid::CHEMBL79087
SMILES OC(=O)C[C@H](NC(=O)[C@@H]1CCCN(C1)C(=O)CCC1CCNCC1)c1cccs1
InChI Key InChIKey=CYKYNQSFAYHHEZ-SJORKVTESA-N
Data  2 IC50
  Tab Delimited (TSV)   2D SDfile   Computed 3D by Vconf -m prep SDfile
Find this compound or compounds like it in BindingDB:
Activity Spreadsheet -- Enzyme Inhibition Constant Data from BindingDB
Found 2 hits for monomerid = 50287969
TargetIntegrin alpha-IIb/beta-3(Homo sapiens (Human))
TBA
Curated by ChEMBL
LigandPNGBDBM50287969((S)-3-{[(R)-1-(3-Piperidin-4-yl-propionyl)-piperid...)
Affinity DataIC50:  0.100nM. Assay description: In vitro inhibition of biotinylated fibrinogen binding to immobilized integrin alpha IIb beta3
In DepthDetails Article
TargetProteinase-activated receptor 1(Homo sapiens (Human))
TBA
Curated by ChEMBL
LigandPNGBDBM50287969((S)-3-{[(R)-1-(3-Piperidin-4-yl-propionyl)-piperid...)
Affinity DataIC50:  90nM. Assay description: In vitro inhibition of thrombin-induced human gel-filtered platelet aggregation.
In DepthDetails Article