BDBM50288090 CHEMBL79772::[(S)-1-(5-Chloro-4-oxo-4H-benzo[d][1,3]oxazin-2-yl)-ethyl]-carbamic acid benzyl ester
SMILES C[C@H](NC(=O)OCc1ccccc1)c1nc2cccc(Cl)c2c(=O)o1
InChI Key InChIKey=BGQSTIUKAKOYRE-NSHDSACASA-N
Data  1 IC50
  Tab Delimited (TSV)   2D SDfile   Computed 3D by Vconf -m prep SDfile
Find this compound or compounds like it in BindingDB:
Activity Spreadsheet -- Enzyme Inhibition Constant Data from BindingDB
Found 1 hit for monomerid = 50288090
TargetCapsid scaffolding protein(Human herpesvirus 1 (strain 17) (HHV-1) (Human her...)
TBA
Curated by ChEMBL
LigandPNGBDBM50288090(CHEMBL79772 | [(S)-1-(5-Chloro-4-oxo-4H-benzo[d][1...)
Affinity DataIC50: >3.00E+5nM. Assay description: Inhibitory activity against herpes simplex type 1 protease (HSV-1 pr).
In DepthDetails Article