BDBM50288097 CHEMBL81237::[1-(2-Isopropylamino-4-oxo-4H-benzo[d][1,3]oxazin-7-ylcarbamoyl)-ethyl]-carbamic acid benzyl ester
SMILES CC(C)Nc1nc2cc(NC(=O)C(C)NC(=O)OCc3ccccc3)ccc2c(=O)o1
InChI Key InChIKey=DNCLRPWRPSXATH-UHFFFAOYSA-N
Data  1 IC50
  Tab Delimited (TSV)   2D SDfile   Computed 3D by Vconf -m prep SDfile
Find this compound or compounds like it in BindingDB:
Activity Spreadsheet -- Enzyme Inhibition Constant Data from BindingDB
Found 1 hit for monomerid = 50288097
TargetCapsid scaffolding protein(Human herpesvirus 1 (strain 17) (HHV-1) (Human her...)
TBA
Curated by ChEMBL
LigandPNGBDBM50288097(CHEMBL81237 | [1-(2-Isopropylamino-4-oxo-4H-benzo[...)
Affinity DataIC50:  5.00E+3nM. Assay description: Inhibitory activity against herpes simplex type 1 protease (HSV-1 pr).
In DepthDetails Article