BDBM50288101 2-Butylamino-benzo[d][1,3]oxazin-4-one::CHEMBL79973
SMILES CCCCNc1nc2ccccc2c(=O)o1
InChI Key InChIKey=KXPTVFDCJCOCOZ-UHFFFAOYSA-N
Data  2 KI  1 IC50  2 Koff  1 Kon
  Tab Delimited (TSV)   2D SDfile   Computed 3D by Vconf -m prep SDfile
Find this compound or compounds like it in BindingDB:
Activity Spreadsheet -- Enzyme Inhibition Constant Data from BindingDB
Found 4 hits for monomerid = 50288101
TargetNeutrophil elastase(Homo sapiens (Human))
Syntex Research
Curated by ChEMBL
LigandPNGBDBM50288101(2-Butylamino-benzo[d][1,3]oxazin-4-one | CHEMBL799...)
Affinity DataKi:  79.4nM Kon:  0.00549M-1s-1 Koff:  6.61E+4s-1Assay Description:Component deacylation rate constant for interaction with human leukocyte elastaseChecked by Author
In DepthDetails ArticlePubMed
TargetNeutrophil elastase(Homo sapiens (Human))
Syntex Research
Curated by ChEMBL
LigandPNGBDBM50288101(2-Butylamino-benzo[d][1,3]oxazin-4-one | CHEMBL799...)
Affinity DataKi:  84nM. Assay description: Rate of deacylation by human leukocyte elastase
In DepthDetails ArticlePubMed
TargetNeutrophil elastase(Homo sapiens (Human))
Syntex Research
Curated by ChEMBL
LigandPNGBDBM50288101(2-Butylamino-benzo[d][1,3]oxazin-4-one | CHEMBL799...)
Affinity DataKon:  0.00550M-1s-1Assay Description:Rate of deacylation by human leukocyte elastase
In DepthDetails ArticlePubMed
TargetCapsid scaffolding protein(Human herpesvirus 1 (strain 17) (HHV-1) (Human her...)
TBA
Curated by ChEMBL
LigandPNGBDBM50288101(2-Butylamino-benzo[d][1,3]oxazin-4-one | CHEMBL799...)
Affinity DataIC50:  3.00E+5nM. Assay description: Inhibitory activity against herpes simplex type 1 protease (HSV-1 pr).
In DepthDetails Article