BDBM50288103 2-(1-Phenyl-ethylamino)-benzo[d][1,3]oxazin-4-one::CHEMBL82262
SMILES CC(Nc1nc2ccccc2c(=O)o1)c1ccccc1
InChI Key InChIKey=DMJBXSNVEWQZBE-UHFFFAOYSA-N
Data  1 IC50
  Tab Delimited (TSV)   2D SDfile   Computed 3D by Vconf -m prep SDfile
Find this compound or compounds like it in BindingDB:
Activity Spreadsheet -- Enzyme Inhibition Constant Data from BindingDB
Found 1 hit for monomerid = 50288103
TargetCapsid scaffolding protein(Human herpesvirus 1 (strain 17) (HHV-1) (Human her...)
TBA
Curated by ChEMBL
LigandPNGBDBM50288103(2-(1-Phenyl-ethylamino)-benzo[d][1,3]oxazin-4-one ...)
Affinity DataIC50:  6.00E+4nM. Assay description: Inhibitory activity against herpes simplex type 1 protease (HSV-1 pr).
In DepthDetails Article