BDBM50288148 CHEMBL85999::Phenyl-acetic acid [2,8-dimethyl-1-oxa-8-aza-spiro[4.5]dec-(3E)-ylidene]-hydrazide
SMILES CC1OC2(CC1=NNC(=O)Cc1ccccc1)CCN(C)CC2
InChI Key InChIKey=REYLQISQFCAFLZ-UHFFFAOYSA-N
Data  1 KI
  Tab Delimited (TSV)   2D SDfile   Computed 3D by Vconf -m prep SDfile
Find this compound or compounds like it in BindingDB:
Activity Spreadsheet -- Enzyme Inhibition Constant Data from BindingDB
Found 1 hit for monomerid = 50288148
LigandPNGBDBM50288148(CHEMBL85999 | Phenyl-acetic acid [2,8-dimethyl-1-o...)
Affinity DataKi:  3.00E+4nM. Assay description: Ability to displace [3H]- pirenzepine from M1 receptor in rat hippocampal membranes
In DepthDetails Article