BDBM50288217 CHEMBL87659::Zwitterionic sulfobetaine derivative
SMILES C[N+](C)(CCCCCc1ccc(cc1)-c1ccccc1)CCCCS([O-])(=O)=O
InChI Key InChIKey=XPCLHFQZYFKTAI-UHFFFAOYSA-N
Data  1 IC50
  Tab Delimited (TSV)   2D SDfile   Computed 3D by Vconf -m prep SDfile
Find this compound or compounds like it in BindingDB:
Activity Spreadsheet -- Enzyme Inhibition Constant Data from BindingDB
Found 1 hit for monomerid = 50288217
TargetSqualene synthase(Rattus norvegicus)
TBA
Curated by ChEMBL
LigandPNGBDBM50288217(CHEMBL87659 | Zwitterionic sulfobetaine derivative)
Affinity DataIC50:  5.00E+3nM. Assay description: Inhibitory activity against rat hepatic squalene synthase
In DepthDetails Article