BDBM50288226 CHEMBL313369::{2-Carboxymethoxy-5-[2-(4-piperidin-4-yl-butyrylamino)-acetyl]-phenoxy}-acetic acid
SMILES OC(=O)COc1ccc(cc1OCC(O)=O)C(=O)CNC(=O)CCCC1CCNCC1
InChI Key InChIKey=GGQTYBWYMJPIKG-UHFFFAOYSA-N
Data  1 IC50
  Tab Delimited (TSV)   2D SDfile   Computed 3D by Vconf -m prep SDfile
Find this compound or compounds like it in BindingDB:
Activity Spreadsheet -- Enzyme Inhibition Constant Data from BindingDB
Found 1 hit for monomerid = 50288226
TargetIntegrin alpha-IIb/beta-3(Homo sapiens (Human))
TBA
Curated by ChEMBL
LigandPNGBDBM50288226(CHEMBL313369 | {2-Carboxymethoxy-5-[2-(4-piperidin...)
Affinity DataIC50: >100nM. Assay description: Biotinylated fibrinogen binding to alpha IIb beta3 integrin
In DepthDetails Article