BDBM50288235 (2-Carboxymethoxy-4-{2-[(piperidine-4-carbonyl)-amino]-acetyl}-phenoxy)-acetic acid::CHEMBL89131
SMILES OC(=O)COc1ccc(cc1OCC(O)=O)C(=O)CNC(=O)C1CCNCC1
InChI Key InChIKey=YHELUMJILNUDBU-UHFFFAOYSA-N
Data  1 IC50
  Tab Delimited (TSV)   2D SDfile   Computed 3D by Vconf -m prep SDfile
Find this compound or compounds like it in BindingDB:
Activity Spreadsheet -- Enzyme Inhibition Constant Data from BindingDB
Found 1 hit for monomerid = 50288235
TargetIntegrin alpha-IIb/beta-3(Homo sapiens (Human))
TBA
Curated by ChEMBL
LigandPNGBDBM50288235((2-Carboxymethoxy-4-{2-[(piperidine-4-carbonyl)-am...)
Affinity DataIC50: >1.00E+3nM. Assay description: Biotinylated fibrinogen binding to alpha IIb beta3 integrin
In DepthDetails Article