BDBM50288560 4-{(2R,4S)-1-(3,5-Dimethyl-benzoyl)-4-[(quinolin-4-ylmethyl)-amino]-piperidin-2-ylmethyl}-benzonitrile::CHEMBL103221
SMILES Cc1cc(C)cc(c1)C(=O)N1CC[C@@H](C[C@H]1Cc1ccc(cc1)C#N)NCc1ccnc2ccccc12
InChI Key InChIKey=BFUFVSBGSHVEOT-URLMMPGGSA-N
Data  1 IC50
  Tab Delimited (TSV)   2D SDfile   Computed 3D by Vconf -m prep SDfile
Find this compound or compounds like it in BindingDB:
Activity Spreadsheet -- Enzyme Inhibition Constant Data from BindingDB
Found 1 hit for monomerid = 50288560
TargetSubstance-P receptor(Homo sapiens (Human))
TBA
Curated by ChEMBL
LigandPNGBDBM50288560(4-{(2R,4S)-1-(3,5-Dimethyl-benzoyl)-4-[(quinolin-4...)
Affinity DataIC50:  21nM. Assay description: Binding affinity against NK1 receptor by displacement of [3H]-SP from bovine retina membranes
In DepthDetails Article