BDBM50288611 Alpha-ketocarbonyl boronic ester derivative::CHEMBL98688
SMILES CC(C)CC(NC(=O)C(CCCN=C(N)N[N+]([O-])=O)NC(=O)C(CCCCCCCCC#N)C1CCCC1)B1OC(C)(C)C(C)(C)O1
InChI Key InChIKey=YAMYHHLOVKJYKZ-UHFFFAOYSA-N
Data  1 IC50
  Tab Delimited (TSV)   2D SDfile   Computed 3D by Vconf -m prep SDfile
Find this compound or compounds like it in BindingDB:
Activity Spreadsheet -- Enzyme Inhibition Constant Data from BindingDB
Found 1 hit for monomerid = 50288611
TargetChymotrypsin-like protease CTRL-1(Homo sapiens (Human))
TBA
Curated by ChEMBL
LigandPNGBDBM50288611(Alpha-ketocarbonyl boronic ester derivative | CHEM...)
Affinity DataIC50:  8nM. Assay description: Compound was tested for inhibition of chymotrypsin-like protease of proteasome from postmortem human liver and brain
In DepthDetails Article